{"text_format":"1","workbook":"xlsx","n_sheets":11,"sheets":["Introduction","LRFR Input","Output HL93, LA3S2, LA3, 3-3","Output HL93, LA6, LA8","Output HL93, NRL, SU4, SU5","Output HL93, NRL, SU6, SU7","Output HL93, OFRD1, 2 & 3","Reference tables","section property tables","seam strength tables","NCSPA Design Data Sheet No 19"],"not_rendered":{"charts":0,"images":19,"macros":1,"external_links":0,"defined_names":44,"comments":0,"pivot_tables":0},"unopened":[],"bounds":{"document_bytes":16777216,"sheet_cells":100000,"rows_first":2000,"rows_last":500,"rows_between":2000,"halvings":0,"cell_chars":16384,"cell_head_chars":4096},"cells_cut":0,"cells_raw":0,"read":"whole","date_system":"1900"}

{"sheet":"Introduction","index":0,"n_rows":32,"n_cols":10,"rows_kept":32,"cut":false,"hidden":false,"merged":[[0,9,12,18],[21,0,21,8],[23,0,23,8],[25,0,25,8],[9,2,9,3],[9,4,9,5],[13,0,13,8],[15,0,15,8],[17,0,17,8],[19,0,19,8],[10,4,10,5],[11,4,11,5],[0,3,0,5],[2,4,2,5],[3,4,3,5],[5,2,5,3],[28,0,28,8],[29,0,29,8],[30,0,30,8],[31,0,31,8],[5,4,5,5],[7,2,7,3],[7,4,7,5],[6,1,6,3],[6,4,6,7]]}
[null,null,null,"INTRODUCTION",null,null,null,null,null,"DISCLAIMER: The Louisiana Department of Transportation and Development (LaDOTD) makes these documents and software available on an \"as is\" basis. All warranties and representations of any kind with regard to said documents and software are disclaimed, including the implied warranties of merchantability and fitness for a particular use. Under no circumstances will the LaDOTD, or any of its officers or employees be liable for any consequential, incidental, special or exemplary damages even if apprised of the likelihood of such damages occurring. The LaDOTD does not warrant the documents and software against deficiencies of any kind. The use of any of these documents and software for work that is under contract with the LaDOTD does not relieve the contractor from any obligations assumed by the contract, or from complete and proper fulfillment of the terms of the contract, nor does it entitle the contractor to compensation for damages or loss which could be attributed to such use.\n\nInformation on this web site is posted to aid in the efficient dissemination of information to designers. The data contained within this web site is periodically updated. Designers are responsible to be aware of any updates and incorporate significant changes into their final design."]
[]
[null,null,null,"Date:","2018-01-29"]
[null,null,null,"Version:","1.0"]
[]
[null,null,"Developed By:",null,"Ohio DOT"]
[null,"Modified By:",null,null,"CBC Engineers under LADOTD contract"]
[null,null,"Reviewed By:",null,"Qiming Chen",null," "]
[]
[null,null,"Maintained By:",null,"Qiming Chen"]
[null,null,null,"Email:","qiming.chen@la.gov"]
[null,null,null,"Phone:","225-379-1412"]
[]
["Genearl: This spreadsheet is designed to aid a qualified engineer in completing the bridge load rating analysis of a corrugated metal pipe cuvlert structure (DOTD culvert structure type: STLRCH, ALURCH, STLPIP, and ALUPIP with corrugation). Sound engineering judgement and familiariry with the analysis are required to choose appropriate input values and to recognize situations that may deviate from the standard case on which these spreadsheets based. This spreadsheet is comprised of six worksheets: Introduction; LRFR Input; Output HL93, LA3S2, LA3, 3-3; Output HL93, LA6, LA8; Output HL93, NRL, SU4, SU5; Output HL93, NRL, SU6, SU7; Output HL93, OFRD1, 2 & 3; Reference tables; section property table; seam strength table; and NCSPA Design Data Sheet No 19. The LRFR Input worksheet is protected. The passoword is \"Rating\"."]
[]
{"$rows_left_out":18}
{"sheet":"LRFR Input","index":1,"n_rows":80,"n_cols":20,"rows_kept":80,"cut":false,"hidden":false,"merged":[[21,10,22,21],[60,3,62,3],[60,2,62,2],[56,4,58,8],[39,1,39,2],[39,3,39,7],[45,4,45,7],[45,1,50,2],[60,1,62,1],[60,4,62,8],[44,3,44,4],[44,1,44,2],[42,3,42,4],[42,1,42,2],[46,4,46,7],[43,1,43,2],[43,3,43,4],[55,1,55,8],[56,1,58,1],[48,5,50,8],[47,4,47,7],[52,3,52,4],[52,1,52,2],[51,3,51,4],[51,1,51,2],[72,14,75,14],[70,14,70,15],[70,13,71,13],[72,13,75,13],[64,1,67,1],[72,10,75,10],[72,11,75,11],[72,12,75,12],[70,10,71,10],[70,11,71,11],[70,12,71,12],[65,4,67,8],[65,2,67,2],[65,3,67,3],[1,4,1,7],[2,6,2,7],[3,6,3,7],[4,6,4,7],[7,1,27,8],[6,1,6,8],[28,1,28,8],[37,1,37,2],[37,3,37,7],[40,5,41,7],[31,1,31,8],[32,1,32,8],[33,1,33,8],[36,3,36,6],[35,1,35,7],[38,1,38,2],[41,1,41,2],[40,1,40,2],[41,3,41,4],[40,3,40,4],[38,3,38,7],[70,18,70,19],[71,18,71,19],[69,10,69,19],[69,1,77,1],[69,4,77,8],[76,15,79,15],[72,18,75,18],[76,16,79,16],[76,17,79,17],[72,19,75,19],[76,10,79,10],[76,11,79,11],[76,12,79,12],[76,13,79,13],[76,14,79,14],[72,15,75,15]]}
[]
[null,"Structure No:",null,"Bridge Name:","LADOTD"]
[null,"Route/Crossing:"," ","ADTT:",630]
[null,"Year Built:",1993,"Load Rated By:","D.N","Date:","2013-01-14"]
[null,"Structure Type:","Corrugated Metal Pipe Arch","Checked By:","M.H.","Date:","2013-01-14"]
[]
[null,"CORRUGATED METAL STRUCTURE (CIRCULAR & PIPE ARCH) & ARCHES "]
[]
[]
[]
[null,null,null,null,null,null,null,null,null,null,"yellow shaded areas are required input."]
[null,null,null,null,null,null,null,null,null,null,"input a value or choose a option from a drop-down list"]
[]
[]
[]
{"$rows_left_out":66}
{"sheet":"Output HL93, LA3S2, LA3, 3-3","index":2,"n_rows":238,"n_cols":9,"rows_kept":238,"cut":false,"hidden":false,"merged":[[10,0,10,1],[55,2,55,4],[54,0,54,1],[43,1,43,2],[44,1,44,2],[45,1,45,2],[46,1,46,2],[47,1,47,2],[14,0,15,5],[19,2,19,3],[21,2,21,3],[21,1,23,1],[37,2,37,4],[33,0,33,1],[49,5,50,6],[23,2,23,3],[6,0,6,6],[7,0,7,6],[8,0,8,6],[1,3,1,6],[2,5,2,6],[3,5,3,6],[4,5,4,6],[225,5,229,5],[221,0,221,4],[200,0,200,2],[11,0,11,5],[12,0,12,5],[13,0,13,5],[59,5,59,6],[119,0,128,6],[94,1,95,1],[135,3,135,4],[97,4,97,5],[98,1,98,2],[98,3,98,5],[99,2,99,5],[65,1,65,3],[82,2,82,4],[108,1,108,2],[81,2,81,4],[173,0,173,5],[190,0,190,5],[157,2,157,5],[174,0,174,5],[175,0,175,5],[172,0,172,5],[176,0,177,5],[179,0,179,6],[31,0,31,2],[139,1,139,2],[88,1,89,1],[109,1,109,2],[58,5,58,6],[62,1,62,3],[61,1,61,3],[58,1,58,3],[59,1,59,3],[39,1,39,3],[56,2,56,4],[57,1,57,3],[83,2,83,4],[81,1,83,1],[63,1,63,3],[64,1,64,3],[209,0,209,2],[223,0,224,0],[225,0,229,0],[32,0,32,2],[16,0,16,5],[17,0,17,5],[60,1,60,3],[138,1,138,2],[27,2,27,3],[24,1,25,4],[40,1,40,3],[38,1,38,3],[29,0,29,1],[29,2,29,5],[129,0,129,6],[22,2,22,3]]}
[]
["Structure No:",{"$f":"'LRFR Input'!C2","v":0},"Bridge Name:",{"$f":"'LRFR Input'!E2","v":"LADOTD"}]
["Route/Crossing:",{"$f":"'LRFR Input'!C3","v":" "},"ADTT:",{"$f":"'LRFR Input'!E3","v":630}]
["Year Built:",{"$f":"'LRFR Input'!C4","v":1993},"Load Rated By:",{"$f":"'LRFR Input'!E4","v":"D.N"},"Date:",{"$f":"'LRFR Input'!G4","v":"2013-01-14"}]
["Structure Type:",{"$f":"'LRFR Input'!C5","v":"Corrugated Metal Pipe Arch"},"Checked By:",{"$f":"'LRFR Input'!E5","v":"M.H."},"Date:",{"$f":"'LRFR Input'!G5","v":"2013-01-14"}]
[]
["LRFR of In-Service, Corrugated Metal Pipe Structures"]
["Based on AASHTO LRFD Bridge Design Specifications, Section 3, 4 & 12 & NCSPA Design Data Sheet No. 19 & ODOT Bridge Design Manual 2004 (effective 10-15-2010), Section 900 & 2008 AASHTO MBE"]
["(do not use this spreadsheet to load rate Structural Plate Box Culverts)"]
[]
["A.   Design Dimensions"]
["   1.  For typical structures, use the actual field measured span for calculations."]
["   2.  For unsymmetrical structures or those deflected over 5%:"]
["       a. use 2 x the top radius (2 Rt) in lieu of span for calculations."]
["       b. base critical buckling stress calculations on the theoretical design span, reducing the resulting allowable buckling stress by the appropriate multiplier to account for deflection \" f \" (NCSPA Design Data Sheet No. 19, Figure B.1.1)."]
{"$rows_left_out":224}
{"sheet":"Output HL93, LA6, LA8","index":3,"n_rows":238,"n_cols":9,"rows_kept":238,"cut":false,"hidden":false,"merged":[[14,0,15,5],[1,3,1,6],[2,5,2,6],[3,5,3,6],[4,5,4,6],[6,0,6,6],[7,0,7,6],[8,0,8,6],[10,0,10,1],[11,0,11,5],[12,0,12,5],[13,0,13,5],[16,0,16,5],[17,0,17,5],[19,2,19,3],[21,1,23,1],[21,2,21,3],[22,2,22,3],[23,2,23,3],[43,1,43,2],[24,1,25,4],[27,2,27,3],[29,0,29,1],[29,2,29,5],[31,0,31,2],[32,0,32,2],[33,0,33,1],[37,2,37,4],[38,1,38,3],[39,1,39,3],[40,1,40,3],[59,1,59,3],[59,5,59,6],[44,1,44,2],[45,1,45,2],[46,1,46,2],[47,1,47,2],[49,5,50,6],[54,0,54,1],[55,2,55,4],[56,2,56,4],[57,1,57,3],[58,1,58,3],[58,5,58,6],[94,1,95,1],[60,1,60,3],[61,1,61,3],[62,1,62,3],[63,1,63,3],[64,1,64,3],[65,1,65,3],[81,1,83,1],[81,2,81,4],[82,2,82,4],[83,2,83,4],[88,1,89,1],[157,2,157,5],[97,4,97,5],[98,1,98,2],[98,3,98,5],[99,2,99,5],[108,1,108,2],[109,1,109,2],[119,0,128,6],[129,0,129,6],[135,3,135,4],[138,1,138,2],[139,1,139,2],[225,0,229,0],[225,5,229,5],[172,0,172,5],[173,0,173,5],[174,0,174,5],[175,0,175,5],[176,0,177,5],[179,0,179,6],[190,0,190,5],[200,0,200,2],[209,0,209,2],[221,0,221,4],[223,0,224,0]]}
[]
["Structure No:",{"$f":"'LRFR Input'!C2","v":0},"Bridge Name:",{"$f":"'LRFR Input'!E2","v":"LADOTD"}]
["Route/Crossing:",{"$f":"'LRFR Input'!C3","v":" "},"ADTT:",{"$f":"'LRFR Input'!E3","v":630}]
["Year Built:",{"$f":"'LRFR Input'!C4","v":1993},"Load Rated By:",{"$f":"'LRFR Input'!E4","v":"D.N"},"Date:",{"$f":"'LRFR Input'!G4","v":"2013-01-14"}]
["Structure Type:",{"$f":"'LRFR Input'!C5","v":"Corrugated Metal Pipe Arch"},"Checked By:",{"$f":"'LRFR Input'!E5","v":"M.H."},"Date:",{"$f":"'LRFR Input'!G5","v":"2013-01-14"}]
[]
["LRFR of In-Service, Corrugated Metal Pipe Structures                                     "]
["Based on AASHTO LRFD Bridge Design Specifications, Section 3, 4 & 12 & NCSPA Design Data Sheet No. 19 & ODOT Bridge Design Manual 2004 (effective 10-15-2010), Section 900 & 2008 AASHTO MBE"]
["(do not use this spreadsheet to load rate Structural Plate Box Culverts)"]
[]
["A.   Design Dimensions"]
["   1.  For typical structures, use the actual field measured span for calculations."]
["   2.  For unsymmetrical structures or those deflected over 5%:"]
["       a. use 2 x the top radius (2 Rt) in lieu of span for calculations."]
["       b. base critical buckling stress calculations on the theoretical design span, reducing the resulting allowable buckling stress by the appropriate multiplier to account for deflection \" f \" (NCSPA Design Data Sheet No. 19, Figure B.1.1)."]
{"$rows_left_out":224}
{"sheet":"Output HL93, NRL, SU4, SU5","index":4,"n_rows":238,"n_cols":9,"rows_kept":238,"cut":false,"hidden":false,"merged":[[14,0,15,5],[1,3,1,6],[2,5,2,6],[3,5,3,6],[4,5,4,6],[6,0,6,6],[7,0,7,6],[8,0,8,6],[10,0,10,1],[11,0,11,5],[12,0,12,5],[13,0,13,5],[16,0,16,5],[17,0,17,5],[19,2,19,3],[21,1,23,1],[21,2,21,3],[22,2,22,3],[23,2,23,3],[43,1,43,2],[24,1,25,4],[27,2,27,3],[29,0,29,1],[29,2,29,5],[31,0,31,2],[32,0,32,2],[33,0,33,1],[37,2,37,4],[38,1,38,3],[39,1,39,3],[40,1,40,3],[59,1,59,3],[59,5,59,6],[44,1,44,2],[45,1,45,2],[46,1,46,2],[47,1,47,2],[49,5,50,6],[54,0,54,1],[55,2,55,4],[56,2,56,4],[57,1,57,3],[58,1,58,3],[58,5,58,6],[94,1,95,1],[60,1,60,3],[61,1,61,3],[62,1,62,3],[63,1,63,3],[64,1,64,3],[65,1,65,3],[81,1,83,1],[81,2,81,4],[82,2,82,4],[83,2,83,4],[88,1,89,1],[157,2,157,5],[97,4,97,5],[98,1,98,2],[98,3,98,5],[99,2,99,5],[108,1,108,2],[109,1,109,2],[119,0,128,6],[129,0,129,6],[135,3,135,4],[138,1,138,2],[139,1,139,2],[225,0,229,0],[225,5,229,5],[172,0,172,5],[173,0,173,5],[174,0,174,5],[175,0,175,5],[176,0,177,5],[179,0,179,6],[190,0,190,5],[200,0,200,2],[209,0,209,2],[221,0,221,4],[223,0,224,0]]}
[]
["Structure No:",{"$f":"'LRFR Input'!C2","v":0},"Bridge Name:",{"$f":"'LRFR Input'!E2","v":"LADOTD"}]
["Route/Crossing:",{"$f":"'LRFR Input'!C3","v":" "},"ADTT:",{"$f":"'LRFR Input'!E3","v":630}]
["Year Built:",{"$f":"'LRFR Input'!C4","v":1993},"Load Rated By:",{"$f":"'LRFR Input'!E4","v":"D.N"},"Date:",{"$f":"'LRFR Input'!G4","v":"2013-01-14"}]
["Structure Type:",{"$f":"'LRFR Input'!C5","v":"Corrugated Metal Pipe Arch"},"Checked By:",{"$f":"'LRFR Input'!E5","v":"M.H."},"Date:",{"$f":"'LRFR Input'!G5","v":"2013-01-14"}]
[]
["LRFR of In-Service, Corrugated Metal Pipe Structures                                     "]
["Based on AASHTO LRFD Bridge Design Specifications, Section 3, 4 & 12 & NCSPA Design Data Sheet No. 19 & ODOT Bridge Design Manual 2004 (effective 10-15-2010), Section 900 & 2008 AASHTO MBE"]
["(do not use this spreadsheet to load rate Structural Plate Box Culverts)"]
[]
["A.   Design Dimensions"]
["   1.  For typical structures, use the actual field measured span for calculations."]
["   2.  For unsymmetrical structures or those deflected over 5%:"]
["       a. use 2 x the top radius (2 Rt) in lieu of span for calculations."]
["       b. base critical buckling stress calculations on the theoretical design span, reducing the resulting allowable buckling stress by the appropriate multiplier to account for deflection \" f \" (NCSPA Design Data Sheet No. 19, Figure B.1.1)."]
{"$rows_left_out":224}
{"sheet":"Output HL93, NRL, SU6, SU7","index":5,"n_rows":238,"n_cols":9,"rows_kept":238,"cut":false,"hidden":false,"merged":[[14,0,15,5],[1,3,1,6],[2,5,2,6],[3,5,3,6],[4,5,4,6],[6,0,6,6],[7,0,7,6],[8,0,8,6],[10,0,10,1],[11,0,11,5],[12,0,12,5],[13,0,13,5],[16,0,16,5],[17,0,17,5],[19,2,19,3],[21,1,23,1],[21,2,21,3],[22,2,22,3],[23,2,23,3],[43,1,43,2],[24,1,25,4],[27,2,27,3],[29,0,29,1],[29,2,29,5],[31,0,31,2],[32,0,32,2],[33,0,33,1],[37,2,37,4],[38,1,38,3],[39,1,39,3],[40,1,40,3],[59,1,59,3],[59,5,59,6],[44,1,44,2],[45,1,45,2],[46,1,46,2],[47,1,47,2],[49,5,50,6],[54,0,54,1],[55,2,55,4],[56,2,56,4],[57,1,57,3],[58,1,58,3],[58,5,58,6],[94,1,95,1],[60,1,60,3],[61,1,61,3],[62,1,62,3],[63,1,63,3],[64,1,64,3],[65,1,65,3],[81,1,83,1],[81,2,81,4],[82,2,82,4],[83,2,83,4],[88,1,89,1],[157,2,157,5],[97,4,97,5],[98,1,98,2],[98,3,98,5],[99,2,99,5],[108,1,108,2],[109,1,109,2],[119,0,128,6],[129,0,129,6],[135,3,135,4],[138,1,138,2],[139,1,139,2],[225,0,229,0],[225,5,229,5],[172,0,172,5],[173,0,173,5],[174,0,174,5],[175,0,175,5],[176,0,177,5],[179,0,179,6],[190,0,190,5],[200,0,200,2],[209,0,209,2],[221,0,221,4],[223,0,224,0]]}
[]
["Structure No:",{"$f":"'LRFR Input'!C2","v":0},"Bridge Name:",{"$f":"'LRFR Input'!E2","v":"LADOTD"}]
["Route/Crossing:",{"$f":"'LRFR Input'!C3","v":" "},"ADTT:",{"$f":"'LRFR Input'!E3","v":630}]
["Year Built:",{"$f":"'LRFR Input'!C4","v":1993},"Load Rated By:",{"$f":"'LRFR Input'!E4","v":"D.N"},"Date:",{"$f":"'LRFR Input'!G4","v":"2013-01-14"}]
["Structure Type:",{"$f":"'LRFR Input'!C5","v":"Corrugated Metal Pipe Arch"},"Checked By:",{"$f":"'LRFR Input'!E5","v":"M.H."},"Date:",{"$f":"'LRFR Input'!G5","v":"2013-01-14"}]
[]
["LRFR of In-Service, Corrugated Metal Pipe Structures                                     "]
["Based on AASHTO LRFD Bridge Design Specifications, Section 3, 4 & 12 & NCSPA Design Data Sheet No. 19 & ODOT Bridge Design Manual 2004 (effective 10-15-2010), Section 900 & 2008 AASHTO MBE"]
["(do not use this spreadsheet to load rate Structural Plate Box Culverts)"]
[]
["A.   Design Dimensions"]
["   1.  For typical structures, use the actual field measured span for calculations."]
["   2.  For unsymmetrical structures or those deflected over 5%:"]
["       a. use 2 x the top radius (2 Rt) in lieu of span for calculations."]
["       b. base critical buckling stress calculations on the theoretical design span, reducing the resulting allowable buckling stress by the appropriate multiplier to account for deflection \" f \" (NCSPA Design Data Sheet No. 19, Figure B.1.1)."]
{"$rows_left_out":224}
{"sheet":"Output HL93, OFRD1, 2 & 3","index":6,"n_rows":238,"n_cols":14,"rows_kept":238,"cut":false,"hidden":false,"merged":[[14,0,15,5],[1,3,1,6],[2,5,2,6],[3,5,3,6],[4,5,4,6],[6,0,6,6],[7,0,7,6],[8,0,8,6],[10,0,10,1],[11,0,11,5],[12,0,12,5],[13,0,13,5],[16,0,16,5],[17,0,17,5],[19,2,19,3],[21,1,23,1],[21,2,21,3],[22,2,22,3],[23,2,23,3],[43,1,43,2],[24,1,25,4],[27,2,27,3],[29,0,29,1],[29,2,29,5],[31,0,31,2],[32,0,32,2],[33,0,33,1],[37,2,37,4],[38,1,38,3],[39,1,39,3],[40,1,40,3],[59,1,59,3],[59,5,59,6],[44,1,44,2],[45,1,45,2],[46,1,46,2],[47,1,47,2],[49,5,50,6],[54,0,54,1],[55,2,55,4],[56,2,56,4],[57,1,57,3],[58,1,58,3],[58,5,58,6],[94,1,95,1],[60,1,60,3],[61,1,61,3],[62,1,62,3],[63,1,63,3],[64,1,64,3],[65,1,65,3],[81,1,83,1],[81,2,81,4],[82,2,82,4],[83,2,83,4],[88,1,89,1],[157,2,157,5],[97,4,97,5],[98,1,98,2],[98,3,98,5],[99,2,99,5],[108,1,108,2],[109,1,109,2],[119,0,128,6],[129,0,129,6],[135,3,135,4],[138,1,138,2],[139,1,139,2],[225,0,229,0],[225,5,229,5],[172,0,172,5],[173,0,173,5],[174,0,174,5],[175,0,175,5],[176,0,177,5],[179,0,179,6],[190,0,190,5],[200,0,200,2],[209,0,209,2],[221,0,221,4],[223,0,224,0]]}
[]
["Structure No:",{"$f":"'LRFR Input'!C2","v":0},"Bridge Name:",{"$f":"'LRFR Input'!E2","v":"LADOTD"}]
["Route/Crossing:",{"$f":"'LRFR Input'!C3","v":" "},"ADTT:",{"$f":"'LRFR Input'!E3","v":630}]
["Year Built:",{"$f":"'LRFR Input'!C4","v":1993},"Load Rated By:",{"$f":"'LRFR Input'!E4","v":"D.N"},"Date:",{"$f":"'LRFR Input'!G4","v":"2013-01-14"}]
["Structure Type:",{"$f":"'LRFR Input'!C5","v":"Corrugated Metal Pipe Arch"},"Checked By:",{"$f":"'LRFR Input'!E5","v":"M.H."},"Date:",{"$f":"'LRFR Input'!G5","v":"2013-01-14"}]
[]
["LRFR of In-Service, Corrugated Metal Pipe Structures                                     "]
["Based on AASHTO LRFD Bridge Design Specifications, Section 3, 4 & 12 & NCSPA Design Data Sheet No. 19 & ODOT Bridge Design Manual 2004 (effective 10-15-2010), Section 900 & 2008 AASHTO MBE"]
["(do not use this spreadsheet to load rate Structural Plate Box Culverts)"]
[]
["A.   Design Dimensions"]
["   1.  For typical structures, use the actual field measured span for calculations."]
["   2.  For unsymmetrical structures or those deflected over 5%:"]
["       a. use 2 x the top radius (2 Rt) in lieu of span for calculations."]
["       b. base critical buckling stress calculations on the theoretical design span, reducing the resulting allowable buckling stress by the appropriate multiplier to account for deflection \" f \" (NCSPA Design Data Sheet No. 19, Figure B.1.1)."]
{"$rows_left_out":224}
{"sheet":"Reference tables","index":7,"n_rows":65,"n_cols":6,"rows_kept":65,"cut":false,"hidden":false,"merged":[[1,1,5,1],[7,1,8,1],[50,1,64,1],[31,1,35,1],[10,1,12,1]]}
[null,null,null,"Minimum Cover (ft.)","←AASHTO DEFINED MINIMUM COVER (AASHTO LRFD table 12.6.6.3-1 & table 12.8.3.1.1-1 for long-span)"]
[null,"Structure Type:","Corrugated Metal Pipe"]
[null,null,"Spiral Rib Steel Pipe",{"$f":"MAX('Output HL93, LA3S2, LA3, 3-3'!D32/4,1)","v":4.7074999999999996}]
[null,null,"Spiral Rib Aluminum Pipe",{"$f":"IF('Output HL93, LA3S2, LA3, 3-3'!D32*12<=48,MAX('Output HL93, LA3S2, LA3, 3-3'!D32/2,1),MAX('Output HL93, LA3S2, LA3, 3-3'!D32/2.75,1))","v":6.8472727272727267}]
[null,null,"Structural Plate Pipe",{"$f":"MAX('Output HL93, LA3S2, LA3, 3-3'!D32/8,1)","v":2.3537499999999998}]
[null,null,"Long Span Structural Plate",{"$f":"IF('LRFR Input'!D38=\"Long Span Structural Plate\",VLOOKUP('Output HL93, LA3S2, LA3, 3-3'!B48,B22:C28,2),\"\")","v":""}]
[]
[null,"Seam Type:","Annular pipe w/ spot welded, riveted or bolted seam"]
[null,null,"Helical pipe w/ lock seam or fully welded seam"]
[]
[null,"Structure Category:","Typical (NCSPA design data sheet No. 19, II. A. 1.)"]
[null,null,"Unsymmetrical  or deflect over 5% (NCSPA design data sheet No. 19, II. A. 2.)"]
[null,null,"Long span (NCSPA design data sheet No. 19, II. A. 3.)"]
[]
[null,"Long Span Structural Plate Structures Minimum Top Arc Thickness Chart (in) (AASHTO LRFD Table 12.8.3.1.1-1)"]
{"$rows_left_out":51}
{"sheet":"section property tables","index":8,"n_rows":35,"n_cols":24,"rows_kept":35,"cut":false,"hidden":false,"merged":[[1,0,1,1],[0,0,0,2],[20,2,20,4],[20,5,20,7],[20,8,20,10],[1,2,1,4],[1,5,1,7],[1,8,1,10],[1,12,1,14],[20,11,20,14],[1,15,1,17],[1,18,1,20],[1,21,1,23],[20,15,20,17],[20,18,20,20],[20,21,20,23]]}
["Cross-Section Properties",null,null,null,null,null,null,"From AASHTO LRFD SECTION 12, APPENDIX A12"]
["Steel",null,"1½ x ¼ (corrugated steel pipe)",null,null,"2⅔ x ½ (corrugated steel pipe)",null,null,"3 x 1 (corrugated steel pipe)",null,null,null,"5 x 1 (corrugated steel pipe)",null,null,"¾ x ¾ x 7½ (spiral rib steel pipe)",null,null,"¾ x 1 x 11½ (spiral rib steel pipe)",null,null,"6 x 2 (steel structural plate pipe)"]
["Gage #","Thickness (in)","As (in2/ft)","r (in)","I x 10-3(in4/in)","As (in2/ft)","r (in)","I x 10-3(in4/in)","As (in2/ft)","r (in)","I x 10-3(in4/in)",null,"As (in2/ft)","r (in)","I x 10-3(in4/in)","As (in2/ft)","r (in)","I x 10-3(in4/in)","As (in2/ft)","r (in)","I x 10-3(in4/in)","As (in2/ft)","r (in)","I x 10-3(in4/in)"]
[null,2.8000000000000001E-2,0.30399999999999999]
[null,3.4000000000000002E-2,0.38]
[null,0.04,0.45600000000000002,8.1600000000000006E-2,{"$f":"0.253","v":0.253},0.46500000000000002,0.17019999999999999,1.121]
[null,5.1999999999999998E-2,0.60799999999999998,8.2400000000000001E-2,0.34399999999999997,0.61899999999999999,0.17069999999999999,1.5]
[16,6.4000000000000001E-2,0.76100000000000001,8.3199999999999996E-2,0.439,0.77500000000000002,0.17119999999999999,1.8919999999999999,0.89,0.3417,8.6590000000000007,null,0.79400000000000004,0.36570000000000003,8.85,0.50900000000000001,0.25800000000000001,2.8210000000000002,0.374,0.38300000000000001,4.58]
[14,7.9000000000000001E-2,0.95,8.4599999999999995E-2,0.56699999999999995,0.96799999999999997,0.1721,2.3919999999999999,1.113,0.3427,10.882999999999999,null,0.99199999999999999,0.36630000000000001,11.092000000000001,0.71199999999999997,0.25,3.7010000000000001,0.52400000000000002,0.373,6.08]
[12,0.109,1.331,8.7900000000000006E-2,0.85699999999999998,1.3560000000000001,0.1741,3.4249999999999998,1.56,0.3448,15.459,null,1.39,0.36770000000000003,15.65,1.1839999999999999,0.23699999999999999,5.5369999999999999,0.88300000000000001,0.35499999999999998,9.26,1.556,0.68200000000000005,60.411000000000001]
[10,0.13800000000000001,1.712,9.1899999999999996E-2,1.2050000000000001,1.744,0.17660000000000001,4.5330000000000004,2.008,0.34720000000000001,20.183,null,1.788,0.36930000000000002,20.317,1.7170000000000001,0.22800000000000001,7.4329999999999998,null,null,null,2.0030000000000001,0.68400000000000005,78.174999999999997]
[8,0.16800000000000001,2.0979999999999999,9.6699999999999994E-2,1.635,2.133,0.17949999999999999,5.7249999999999996,2.4580000000000002,0.34989999999999999,25.091000000000001,null,2.1859999999999999,0.37109999999999999,25.091999999999999,null,null,null,null,null,null,2.4489999999999998,0.68600000000000005,96.162999999999997]
[7,0.188,null,null,null,null,null,null,null,null,null,null,null,null,null,null,null,null,null,null,null,2.7389999999999999,0.68799999999999994,108]
[5,0.218,null,null,null,null,null,null,null,null,null,null,null,null,null,null,null,null,null,null,null,3.1989999999999998,0.69,126.922]
[3,0.249,null,null,null,null,null,null,null,null,null,null,null,null,null,null,null,null,null,null,null,3.65,0.69199999999999995,146.172]
{"$rows_left_out":21}
{"sheet":"seam strength tables","index":9,"n_rows":30,"n_cols":12,"rows_kept":30,"cut":false,"hidden":false,"merged":[[23,9,29,9],[16,1,17,1],[16,2,17,2],[16,3,17,3],[16,4,17,4],[16,5,17,5],[16,6,17,6],[16,7,17,7],[16,8,17,8],[18,7,22,7],[16,9,17,9],[15,5,15,6],[18,2,19,2],[18,5,19,5],[20,2,22,2],[20,5,22,5],[0,0,0,4],[15,14,15,16],[15,17,15,19],[1,7,1,10],[1,0,1,1],[1,2,1,4],[1,5,1,6],[5,7,11,7],[12,7,13,7],[5,2,7,2],[3,2,4,2],[3,5,4,5],[5,5,7,5],[15,9,15,11],[15,7,15,8],[15,2,15,4]]}
["Minimum Longitudinal Seam Strength",null,null,null,null,"From AASHTO LRFD SECTION 12, APPENDIX A12"]
["Steel",null,"2 x ½ & 2⅔ x ½  (corrugated steel pipe) - Riveted or Spot Welded",null,null,"3 x 1 (corrugated steel pipe) - Riveted or Spot Welded",null,"6 x 2 (steel structural plate pipe)"]
["Gage #","Thickness (in)","Rivet Size                   (in)","Single Rivets (k/ft)","Double Rivets (k/ft)","Rivet Size                   (in)","Double Rivets (k/ft)","Diameter      (in)","4 Bolts/ft (k/ft)","6 Bolts/ft (k/ft)","8 Bolts/ft (k/ft)"]
[16,6.4000000000000001E-2,0.3125,16.7,21.6,"⅜",28.7]
[14,7.9000000000000001E-2,null,18.2,29.8,null,35.700000000000003]
[12,0.109,"⅜",23.4,46.8,0.4375,53,"¾",43]
[10,0.13800000000000001,null,24.5,49,null,63.7,null,62]
[8,0.16800000000000001,null,25.6,51.3,null,70.7,null,81]
[7,0.188,null,null,null,null,null,null,93]
[5,0.218,null,null,null,null,null,null,112]
[3,0.249,null,null,null,null,null,null,132]
[1,0.28000000000000003,null,null,null,null,null,null,144,180,194]
[null,0.318,null,null,null,null,null,"⅞",null,null,235]
[null,0.38,null,null,null,null,null,null,null,null,285]
[]
{"$rows_left_out":16}
{"sheet":"NCSPA Design Data Sheet No 19","index":10,"n_rows":0,"n_cols":0,"rows_kept":0,"cut":false,"hidden":false,"merged":[]}