{"text_format":"1","workbook":"xlsx","n_sheets":7,"sheets":["EarlyExit","Flowcharts","Overview","Instructions","Stage1A","Stage1B","Stage2"],"not_rendered":{"charts":0,"images":4,"macros":1,"external_links":2,"defined_names":30,"comments":0,"pivot_tables":0},"unopened":[],"bounds":{"document_bytes":16777216,"sheet_cells":100000,"rows_first":2000,"rows_last":500,"rows_between":2000,"halvings":0,"cell_chars":16384,"cell_head_chars":4096},"cells_cut":0,"cells_raw":0,"read":"whole","date_system":"1900"}

{"sheet":"EarlyExit","index":0,"n_rows":97,"n_cols":28,"rows_kept":97,"cut":false,"hidden":true,"merged":[[82,2,83,2],[90,2,91,2],[1,3,1,14],[6,4,6,5],[10,20,10,23],[58,2,59,2],[66,2,67,2],[74,2,75,2]]}
[]
[null,null,null,"4- LEGGED   EARLY EXIT- 13  INTERSECTION FORMS: SORTED BY AADT CROSS PRODUCT  AND TYPE- 76 OPTIONS",null,null,null,null,null,null,null,null,null,null,null,null,null,null,null,null,"Methodology:  Using the HCM expanded planning tool including conventional and alternative intersections"]
[null,null,null,null,null,null,null,null,null,null,null,null,null,null,null,null,null,null,null,null,"1. Set default values for K,D, %Turns,PHF,%HV  and C-- remained fixed throughout"]
[null,null,null,"Fixed:","PHF=0.95","%RT=%LT=10%",0.1,"D=",0.5,"    D=0.5","%HV=5%","     K=0.1",null,null,null,null,null,null,null,null,"2. Selected AADT ratio and appropriate  lane configuration  (1:1, 2:1, 3:2, etc…)"]
[null,null,null,"Single LT Lane ON all approaches",null,null,null,null," Shared T+R  ON all approaches","Shared T+R Lanes",null,null,"Cycle Length="," C= 150 SEC",null,null,null,null,null,null,"3. In my spreadsheet  I Increased major street AADT until any lane group for the intersection form gets to v/c =1.1"]
[null,null,null,"Number of through lanes proportional to AADT ratio when possible",null,null,null,null,null,null,null,null,"Green times optimized","Greens Optimized",null,null,null,null,null,null,"4. Recorded the perlane AADT for both roads and generate SUM ADTs and their Cross Product (CP) in the table on the left"]
[null,null,null,null,"FAILURE AT   X = 1.10 ",null,"CROSS",null,null,null,"Major Rd","Minor Rd","OVERALL","Rounded ","AADT",null,null,null,null,null,"5. For application: Enter major and minor AADT for the subject intersection in the block below"]
[null,null,null,"AADT","Major AADT @ Failure","Minor AADT  @Failure","PRODUCT (in 10^6)","Sum","PERCENT","# Thru Lanes","AADT at Failure","AADT at Failure","SUM INTERSECTION","SUM-AADT            @Failure","CROSS PRODUCT AT FAILURE",null,null,null,null,null,"6. Table dynamically highlights types and designs meeting CP-Min**"]
[null,null,null,"RATIO","PER LANE","PER LANE","AT FAILURE","AADT/LANE","LEFT TURNS","Major x Minor",null,null,"AADT @Failure",null,"in Millions",null,null,null,null,null,"**CP Min includes a 30% conflation of actual CP to account for default values assumptions"]
[null,null,null,"D","E","F",null,"H","I","J","K","L","M","N","O"]
[null,null,"SIGNAL","1:1",7935,7935,{"$f":"E11*F11/10^6","v":62.964224999999999},{"$f":"E11+F11","v":15870},10,"1X1",{"$f":"E11*2","v":15870},{"$f":"F11*2","v":15870},{"$f":"K11+L11","v":31740},{"$f":"ROUND(M11/1000,0)*1000","v":32000},{"$f":"K11*L11/10^6","v":251.8569},null,null,null,{"$f":"IF(O11<$W$17,0,IF(O11>$W$18,0,1))","v":0},null,"INPUT SITE AND AADT FOR MAJOR AND MINOR RD.",null,null,null,null,null,null,"Verification with  Coventional Signal 1x 1,AADT Ratio  1:1"]
[null,null,null,"2:1",7905,7905,62.489024999999998,15810,10,"2X1",{"$f":"E12*4","v":31620},{"$f":"F12*2","v":15810},{"$f":"K12+L12","v":47430},47000,499.91219999999998,null,null,null,{"$f":"IF(O12<$W$17,0,IF(O12>$W$18,0,1))","v":0},null,"Glenwood and Milbrook (2021)",null,null,null,null,null,null,"Max AADT that causes a lane group v/c to  ~ 1.1"]
[null,null,null,"3:1",7500,7500,56.25,15000,10,"3X1",{"$f":"E13*6","v":45000},{"$f":"F13*2","v":15000},{"$f":"E13*8","v":60000},60000,675,null,null,null,0,null,"Major AADT",40000,"Minor AADT",15000,null,null,null,"Start with SUM AADT = 32000"]
[null,null,"Mean/Lane","1:1",6900,6900,47.61,13800,10,"2X2",{"$f":"E14*4","v":27600},{"$f":"F14*4","v":27600},{"$f":"E14*8","v":55200},55000,761.76,null,null,null,0,null,"Sum AADT=",null,{"$f":"V13+X13","v":55000},null,null,null,null,"Per street  per day= 16,000"]
[null,null,null,"4:1",7188,7188,51.667344,14376,10,"4X1",{"$f":"E15*8","v":57504},{"$f":"F15*2","v":14376},{"$f":"E15*10","v":71880},72000,826.677504,null,null,null,1,null,"AADT Ratio=",null,{"$f":"V13/X13","v":2.6666666666666665},"    to      1",null,null,null,"Per direction in street per day  = 16000x 0.5=8000"]
{"$rows_left_out":83}
{"sheet":"Flowcharts","index":1,"n_rows":54,"n_cols":15,"rows_kept":54,"cut":false,"hidden":true,"merged":[[22,14,24,29],[53,0,53,13],[0,0,0,13],[2,14,2,28],[9,14,12,27],[17,14,19,29]]}
["Stage 1 (From Bastian)"]
[null,null,null,null,null,null,null,null,null,null,null,null,null,null,"Bastian's 1st Draft"]
[null,null,null,null,null,null,null,null,null,null,null,null,null,null,"Please take a look at this potential framework for Stage 1 based on the discussion this morning. I tried to capture the discussion related to Stage 0 and Stage 1, including sequence and decision points. In the framework, blue cells are steps in the method (and maybe tabs in the tool?), orange are data needs, and green are questions each step is trying to answer (we can discuss these further in the guide). The yellow cells are three decision points by the user:"]
[null,null,null,null,null,null,null,null,null,null,null,null,null,null,"1.2 Early Exits decides what to exclude early-on based on the initial feasibility"]
[null,null,null,null,null,null,null,null,null,null,null,null,null,null,"1.5 decides on the relative weights for the stage 1 assessment method based on context and equity (we should develop some defaults for this)"]
[null,null,null,null,null,null,null,null,null,null,null,null,null,null,"1.8 then decides what to move on to Stage 2"]
[null,null,null,null,null,null,null,null,null,null,null,null,null,null,"There is NOT a decision point between various components of Step 1.6 … idea is for a user to look at ALL assessment methods before jumping to any conclusions."]
[]
[null,null,null,null,null,null,null,null,null,null,null,null,null,null,"Shannon's Comments"]
[null,null,null,null,null,null,null,null,null,null,null,null,null,null,"As someone who was not on the call last week but has a background on ICE, I think this graphic makes a lot of sense. My only comment is on the second question in 1.7 “What alternatives are feasible?” this seems more suited for 1.8. The way its laid out currently makes it seem like at 1.7 you need to make a cut of intersections (i.e. cut what is not feasible in 1.7, then in 1.8 take all the feasible and pick your preferred(s) for further assessment which feels a bit like putting your hand on the scale), but I think it makes more sense for there to be only 2 cuts (1.2 and 1.8)."]
[]
[]
[]
[]
[null,null,null,null,null,null,null,null,null,null,null,null,null,null,"Paul's Comments"]
{"$rows_left_out":40}
{"sheet":"Overview","index":2,"n_rows":34,"n_cols":3,"rows_kept":34,"cut":false,"hidden":false,"merged":[[2,2,2,11],[3,1,3,12],[6,1,6,12],[8,1,8,12],[9,1,9,12],[22,1,22,12],[26,1,27,12],[29,1,29,12],[12,1,12,12],[15,1,15,12],[16,1,16,12],[18,1,18,12],[21,1,21,12],[19,1,19,12],[24,1,24,12]]}
[]
[]
[null,null,"NCHRP Project 17-98 "]
[null,"Intersection Control Evaluation (ICE)\nProcess Tool"]
[]
[]
[null,"Build: 2024-09"]
[]
[null,"NCHRP Project 17-98"]
[null,"© 2023 National Academy of Sciences"]
[]
[null,"ACKNOWLEDGMENT OF SPONSORSHIP"]
[null,"The National Cooperative Highway Research Program (NCHRP) produces ready-to-implement solutions to the challenges facing transportation professionals. NCHRP is sponsored by the individual state departments of transportation of the American Association of State Highway and Transportation Officials. NCHRP is administered by the Transportation Research Board (TRB), part of the National Academies of Sciences, Engineering, and Medicine, under a cooperative agreement with the Federal Highway Administration (FHWA).  "]
[]
[null,"COPYRIGHT"]
{"$rows_left_out":20}
{"sheet":"Instructions","index":3,"n_rows":17,"n_cols":4,"rows_kept":17,"cut":false,"hidden":false,"merged":[[1,1,2,3],[4,1,4,3],[9,1,9,3],[12,1,12,3]]}
[]
[null,"INTERSECTION EVALUATION TOOL (ICE) USER INSTRUCTIONS"]
[]
[null,"Stage/Workflow No.","Input Fields","External Tool(s) Used"]
[null,"STAGE 1A"]
[null,"1. Project Data","Enter basic project data in yellow fields including project name, location, intersecting road names, analyst, date of analysis and a brief description of the project purpose (250 characters max)","None"]
[null,"2. Project Context","Using text and drop down boxes, select context including applicability of interchange/grade separation, surrounding area context, number of lanes and short answers to equity context questions (225 characters max)","None"]
[null,"3. Roadway Data","Select roadway functional class, no. of lanes, AADT and ROW for each facility. Note: AADT values should be future design year volumes if user is intending on evaluating intersection alternative capacity through a project design year.","None"]
[null,"4. Intersection Feasibility","Based on the data from previous workflow items, the Tool will select which intersection alternatives should be carried into Stage 1A and which should be eliminated; however, in some cases, the used must decide if the intersection alternative is applicable by changing the --Yes/No-- cell value to either Yes or No. At the bottom of the page, the user can enter (write-in) a unique intersection alternative (excluded in list above) and select that alternate for consideration in Stage 1B.","None"]
[null,"STAGE 1B"]
[null,"5. Screening Data","Users input screening results using CAP-X, Safe Systems Intersection (SSI) and a high-level determination of environmental impacts (using drop-down menu choices) for each alternative. Users will use this data to evaluate and select which alternative should procced for further analysis in Stage 2 by selecting \"Yes\" in the far-right column.","CAP-X Tool\nCAP-X Bike/Ped Tool\nSSI Worksheet"]
[null,"6. Shortlist","The data from the previous workflow item is re-ordered according to SSI score, and the data inputs are color coded (shades of green, yellow, red) to rank the intersection alternatives for each category. In the box at the bottom of the worksheet, users should input the factors that led to the elimination of the alternatives not moving forward into Stage 2.","None"]
[null,"STAGE 2"]
[null,"Context of Stage 2:","The Stage 2 Worksheet is meant to be filled out and used at a Project Review Meeting to document the decision making process determine the final intersection alternative selection of the project. At the top of the form, fill in the date of the meeting and all project team members in attendance.","None"]
[null,"7. Context & Equity Summary","This workflow item summarizes the equity goals for the project input in Stage 1A and users are to include key findings from the Equity worksheet exercise.","Equity Worksheet"]
{"$rows_left_out":3}
{"sheet":"Stage1A","index":4,"n_rows":64,"n_cols":34,"rows_kept":64,"cut":false,"hidden":false,"merged":[[22,28,22,33],[21,12,23,12],[21,13,23,13],[14,0,14,2],[15,0,15,2],[16,0,16,2],[17,0,17,2],[20,0,20,1],[21,0,21,1],[20,2,20,3],[21,2,21,3],[22,19,23,19],[22,22,22,27],[22,17,23,17],[22,18,23,18],[22,16,23,16],[18,0,18,6],[22,0,22,6],[22,14,23,14],[22,15,23,15],[12,0,12,5],[22,10,23,10],[22,11,23,11],[14,3,14,6],[15,3,15,6],[16,3,16,6],[23,2,23,5],[22,8,23,8],[22,9,23,9],[17,3,17,6],[7,0,9,0],[10,0,10,6],[5,1,5,3],[6,1,6,3],[10,15,10,16],[7,1,9,6],[22,20,23,20],[22,21,23,21],[1,25,1,30],[53,0,53,1],[54,0,54,1],[1,15,1,17],[2,0,2,6],[0,0,1,6],[1,21,1,22],[1,8,1,13],[6,5,6,6],[9,21,9,22],[3,1,3,6],[4,1,4,6],[5,5,5,6],[11,0,11,5]]}
["INTERSECTION EVALUATION (ICE) PROCESS TOOL STAGE 1A",null,null,null,null,null,null,null,"Hide","Hide","Hide","Hide",null,"Hide","Hide","Hide","Hide","Hide","Hide","Hide","Hide","Hide","Hide","Hide","Hide","Hide","Hide","Hide","Hide","Hide","Hide","Hide","Hide","Hide"]
[null,null,null,null,null,null,null,null,"STAGE 2 SHORTLIST (16 Max)",null,null,null,null,null,null,"Functional Roadway Classification",null,null,null,"Yes/No",null,"Area Context",null,"K-factor",null,"Estimated Turning Fractions"]
["1. PROJECT DATA",null,null,null,null,null,null,null,{"$f":"IF(ISBLANK(J3),\"\",1)","v":1},{"$f":"_xlfn._xlws.FILTER(IntType,INDIRECT(G24)=\"Yes\",\"\")","v":{"$error":"#NAME?"}},null,null,null,null,null,"-- roadway type --",null,null,null,"--Yes/No--",null,"-- Area Context --",null,{"$f":"VLOOKUP(D14,V4:X8,3,0)","v":0.1},null,"From","To","Code","LT%","TH%","RT%"]
["Project Name:","State University Intersection Study",null,null,null,null,null,null,{"$f":"IF(ISBLANK(J4),\"\",2)","v":2},{"$error":"#NAME?"},null,null,null,null,null,"Freeway/Expressway",null,1,null,"Yes",null,"Urban Core",null,0.12,null,"Principal Arterial","Principal Arterial",11,0.2,0.51,0.28999999999999998]
["Location:","College Town, North Carolina",null,null,null,null,null,null,{"$f":"IF(ISBLANK(J5),\"\",3)","v":3},{"$error":"#NAME?"},null,null,null,null,null,"Principal Arterial",null,2,null,"No",null,"Urban",null,0.11,null,"Principal Arterial","Minor Arterial",12,0.14000000000000001,0.77,0.09]
["Major Road:","University Avenue",null,null,"Analyst:","Kittelson",null,null,{"$f":"IF(ISBLANK(J6),\"\",4)","v":4},{"$error":"#NAME?"},null,null,null,null,null,"Minor Arterial",null,3,null,null,null,"Suburban",null,0.1,null,"Principal Arterial","Major Collector",13,0.09,0.82,0.09]
["Crossing Street:","College Avenue",null,null,"Analysis Date:","2023-02-15",null,null,{"$f":"IF(ISBLANK(J7),\"\",5)","v":5},{"$error":"#NAME?"},null,null,null,null,null,"Collector",null,4,null,null,null,"Rural Town",null,0.09,null,"Principal Arterial","Local Road",14,0.06,0.92,0.02]
["Brief Description of Project Purpose:","[Provide brief description: 140 Characters Max]",null,null,null,null,null,null,{"$f":"IF(ISBLANK(J8),\"\",6)","v":6},{"$error":"#NAME?"},null,null,null,null,null,"Local Road",null,5,null,null,null,"Rural",null,0.08,null,"Principal Arterial","Principal Arterial",21,0.32,0.4,0.28000000000000003]
[null,null,null,null,null,null,null,null,{"$f":"IF(ISBLANK(J9),\"\",7)","v":7},{"$error":"#NAME?"},null,null,null,null,null,"Crossing Road Code",null,{"$f":"VALUE(CONCATENATE(VLOOKUP(C22,P4:R7,3,0),VLOOKUP(C21,P4:R7,3,0)))","v":42},null,null,null,null,null,null,null,"Minor Arterial","Minor Arterial",22,0.22,0.59,0.19]
[null,null,null,null,null,null,null,null,{"$f":"IF(ISBLANK(J10),\"\",8)","v":""},null,null,null,null,null,null,null,null,null,null,null,null,"Lane Adj Factor",null,null,null,"Minor Arterial","Major Collector",23,0.19,0.73,0.08]
["2. PROJECT CONTEXT",null,null,null,null,null,null,null,{"$f":"IF(ISBLANK(J11),\"\",9)","v":""},null,null,null,null,null,null,"Peak Period",null,null,null,null,null,1,1,null,null,"Minor Arterial","Local Road",24,0.11,0.4,0.49]
["Is an interchange form present or viable given the local context?",null,null,null,null,null,"No",null,{"$f":"IF(ISBLANK(J12),\"\",10)","v":""},null,null,null,null,null,null,1,"AM Peak",null,null,null,null,2,1.81,null,null,"Major Collector","Principal Arterial",31,0.43,0.23,0.34]
["Is a grade separation form present or viable given the local context?",null,null,null,null,null,"Yes",null,{"$f":"IF(ISBLANK(J13),\"\",11)","v":""},null,null,null,null,null,null,2,"PM Peak",null,null,null,null,3,2.67,null,null,"Major Collector","Minor Arterial",32,0.34,0.33,0.33]
["What is surrounding intersection area context?",null,null,"Suburban","Number of intersection legs?",null,4,null,{"$f":"IF(ISBLANK(J14),\"\",12)","v":""},null,null,null,null,null,null,3,"Mid Day",null,null,null,null,4,3.5,null,null,"Major Collector","Major Collector",33,0.2,0.57999999999999996,0.22]
["What travel modes are present (or likely to be present) at the study location?",null,null,"[Provide short answer: 225 characters max]",null,null,null,null,{"$f":"IF(ISBLANK(J15),\"\",13)","v":""},null,null,null,null,null,null,null,null,null,null,null,null,"MajLF",{"$f":"VLOOKUP(E21,V11:W14,2,0)","v":1.81},null,null,"Major Collector","Local Road",34,0.35,0.55000000000000004,0.1]
{"$rows_left_out":50}
{"sheet":"Stage1B","index":5,"n_rows":61,"n_cols":18,"rows_kept":61,"cut":false,"hidden":false,"merged":[[60,1,68,9],[42,1,42,9],[25,1,25,9],[7,3,7,5],[7,6,7,7],[7,8,8,8],[8,11,8,14],[5,11,5,13],[6,11,6,12],[0,0,8,0],[6,1,6,9],[0,1,1,9],[7,9,8,9],[2,2,2,9],[3,2,3,9],[4,2,4,9],[5,6,5,7],[5,2,5,5],[5,8,5,9]]}
["Rank by SSI","INTERSECTION EVALUATION TOOL (ICE) PROCESS TOOL STAGE 1B",null,null,null,null,null,null,null,null,null,"Hide","Hide","Hide","Hide","Hide","Hide","Hide"]
[]
[null,"Project Name:",{"$f":"ProjName","v":"State University Intersection Study"}]
[null,"Intersection:",{"$f":"CONCATENATE(Stage1A!B6,\" at \",Stage1A!B7)","v":"University Avenue at College Avenue"}]
[null,"Location:",{"$f":"Location","v":"College Town, North Carolina"},null,null,null,null,null,null,null,null,null,null,null,null,null,"ENV"]
[null,"Analyst:",{"$f":"Analyst","v":"Kittelson"},null,null,null,"Study Date:",null,{"$f":"StudyDate","v":"2023-02-15"},null,null,"Max/Min V/C",null,null,null,null,"--select--"]
[null,"5. SCREENING DATA",null,null,null,null,null,null,null,null,null,"Max V/C",null,1,null,null,"No perceived impacts"]
[null,null,null,"Cap-X V/C Results",null,null," Cap-X Bike/Ped Score",null,"Environmental Impacts","SSI      Score",null,null,null,null,null,null,"Needs investigation"]
[null,"Intersection Form",null,{"$f":"Peak_1","v":"AM Peak"},{"$f":"Peak_2","v":"PM Peak"},{"$f":"Peak_3","v":"Mid Day"},"Bike","Ped",null,null,null,"Max V/C Check",null,null,null,null,"Potentially infeasible"]
[{"$f":"IF($J10=\"\",\"\",RANK($J10,$J$10:$J$25,1)+COUNTIF($J$10:$J10,$J10)-1)","v":4},{"$f":"IF(Stage1A!J3<>0,Stage1A!J3,\"\")","v":{"$error":"#NAME?"}},null,0.6,0.7,0.6,3,4.8,"No perceived impacts",90,null,{"$f":"IF(D10>$N$7,1,0)","v":0},{"$f":"IF(E10>$N$7,1,0)","v":0},{"$f":"IF(F10>$N$7,1,0)","v":0},{"$f":"IF(SUM(L10:N10)=0,\"All\",IF(SUM(L10:N10)=1,\"2of3\",IF(SUM(L10:N10)=2,\"1of3\",\"No\")))","v":"All"},null,"Unacceptable impacts"]
[{"$f":"IF($J11=\"\",\"\",RANK($J11,$J$10:$J$25,1)+COUNTIF($J$10:$J11,$J11)-1)","v":1},{"$f":"IF(Stage1A!J4<>0,Stage1A!J4,\"\")","v":{"$error":"#NAME?"}},null,0.9,1.1000000000000001,0.8,4.9000000000000004,3.2,"Needs investigation",65,null,0,1,0,{"$f":"IF(SUM(L11:N11)=0,\"All\",IF(SUM(L11:N11)=1,\"2of3\",IF(SUM(L11:N11)=2,\"1of3\",\"No\")))","v":"2of3"}]
[{"$f":"IF($J12=\"\",\"\",RANK($J12,$J$10:$J$25,1)+COUNTIF($J$10:$J12,$J12)-1)","v":5},{"$f":"IF(Stage1A!J5<>0,Stage1A!J5,\"\")","v":{"$error":"#NAME?"}},null,0.4,0.5,0.4,4.5,4.0999999999999996,"Potentially infeasible",90,null,0,0,0,"All",null,"Yes/No"]
[{"$f":"IF($J13=\"\",\"\",RANK($J13,$J$10:$J$25,1)+COUNTIF($J$10:$J13,$J13)-1)","v":2},{"$f":"IF(Stage1A!J6<>0,Stage1A!J6,\"\")","v":{"$error":"#NAME?"}},null,0.3,0.4,0.3,2,3.7,"No perceived impacts",70,null,0,0,0,"All",null,"Yes"]
[{"$f":"IF($J14=\"\",\"\",RANK($J14,$J$10:$J$25,1)+COUNTIF($J$10:$J14,$J14)-1)","v":3},{"$f":"IF(Stage1A!J7<>0,Stage1A!J7,\"\")","v":{"$error":"#NAME?"}},null,0.4,0.5,0.4,4,2.9,"Potentially infeasible",75,null,0,0,0,"All",null,"No"]
[{"$f":"IF($J15=\"\",\"\",RANK($J15,$J$10:$J$25,1)+COUNTIF($J$10:$J15,$J15)-1)","v":""},{"$f":"IF(Stage1A!J8<>0,Stage1A!J8,\"\")","v":{"$error":"#NAME?"}},null,null,null,null,null,null,null,null,null,0,0,0,"All"]
{"$rows_left_out":47}
{"sheet":"Stage2","index":6,"n_rows":90,"n_cols":27,"rows_kept":90,"cut":false,"hidden":false,"merged":[[1,22,1,23],[4,7,6,8],[6,5,6,6],[1,0,2,17],[3,7,3,8],[3,1,3,6],[4,1,4,6],[5,1,5,6],[3,9,3,17],[4,9,6,17],[6,1,6,3],[30,0,30,1],[21,17,22,17],[33,3,33,17],[52,5,52,8],[1,19,1,20],[14,0,16,0],[8,1,10,6],[8,7,8,17],[9,7,19,17],[7,0,7,17],[27,0,27,1],[28,0,28,1],[8,0,10,0],[11,0,13,0],[17,0,19,0],[21,15,21,16],[58,5,58,8],[20,0,20,17],[21,4,21,6],[21,3,22,3],[21,7,21,9],[21,10,21,11],[21,12,21,13],[21,14,22,14],[32,0,32,17],[34,0,45,17],[53,9,53,11],[29,0,29,1],[31,0,31,1],[24,0,24,1],[25,0,25,1],[26,0,26,1],[21,2,22,2],[21,0,22,1],[11,1,13,6],[14,1,16,6],[17,1,19,6]]}
[null,null,null,null,null,null,null,null,null,null,null,null,null,null,null,null,null,null,null,"Hide","Hide","Hide","Hide","Hide","Hide","Hide","Hide"]
["INTERSECTION EVALUATION TOOL (ICE) PROCESS TOOL STAGE 2",null,null,null,null,null,null,null,null,null,null,null,null,null,null,null,null,null,null,"Stakeholder Support",null,null,"Stakeholder Support",null,null,"99,190,123"]
[null,null,null,null,null,null,null,null,null,null,null,null,null,null,null,null,null,null,null,1,"Strong",null,1,"Yes",null,"196,215,155"]
["Project Name:",{"$f":"ProjName","v":"State University Intersection Study"},null,null,null,null,null,"Review Mtg Date:",null,"2023-02-22",null,null,null,null,null,null,null,null,null,2,"Supportive",null,2,"No",null,"255,235,132"]
["Intersection:",{"$f":"Stage1B!C4","v":"University Avenue at College Avenue"},null,null,null,null,null,"Review Meeting Attendees (List):",null,"Joe Smith - Town Manager; Steve Jones - DOT Representative; Guy Smiley - Consultant",null,null,null,null,null,null,null,null,null,3,"Unknown",null,3,"Partially",null,"251,170,119"]
["Location:",{"$f":"Location","v":"College Town, North Carolina"},null,null,null,null,null,null,null,null,null,null,null,null,null,null,null,null,null,4,"Negative",null,null,null,null,"248,105,107"]
["Analyst:",{"$f":"Analyst","v":"Kittelson"},null,null,"Date:",{"$f":"StudyDate","v":"2023-02-15"},null,null,null,null,null,null,null,null,null,null,null,null,null,5,"Opposition"]
["7. CONTEXT & EQUITY SUMMARY"]
["Study area travel modes present and/or likely:",{"$f":"Stage1A!D15","v":"[Provide short answer: 225 characters max]"},null,null,null,null,null,"Summary of Equity Studies (from Equity Worksheet):"]
[null,null,null,null,null,null,null,"[Summary of Equity Study Results]"]
[]
["Travel needs for transporation mode(s):",{"$f":"Stage1A!D16","v":"[Provide short answer: 225 characters max]"}]
[]
[]
["History of neighborhood & road development:",{"$f":"Stage1A!D17","v":"[Provide short answer: 225 characters max]"}]
{"$rows_left_out":75}